Target
Serotonin 2 (5-HT2) receptor
Ligand
BDBM50019966
Substrate
Meas. Tech.
ChEMBL_1927 (CHEMBL616981)
IC50
8.4±n/a nM
Citation
 Bøgesø, KPArnt, JBoeck, VChristensen, AVHyttel, JJensen, KG Antihypertensive activity in a series of 1-piperazino-3-phenylindans with potent 5-HT2-antagonistic activity. J Med Chem 31:2247-56 (1989)  
Target
Name:
Serotonin 2 (5-HT2) receptor
Synonyms:
5-hydroxytryptamine receptor 2A/2B/2C
Type:
Mol. Mass.:
Description:
ASSAY_ID of ChEMBL is 2197419
Components:
This complex has 3 components.
Component 1
Name:
5-hydroxytryptamine receptor 2B
Synonyms:
5-HT2B 5HT2B_RAT Serotonin 2b (5-HT2b) receptor Srl
Type:
Enzyme Catalytic Domain
Mol. Mass.:
53668.47
Organism:
RAT
Description:
5-HT2B HTR2B RAT::P30994
Residue:
479
  
Component 2
Name:
5-hydroxytryptamine receptor 2C
Synonyms:
5-HT2C 5-hydroxytryptamine receptor 2C (5HT2c) 5ht1c Htr2c Serotonin receptor 2a and 2c (5HT2A and 5HT2C)
Type:
Enzyme
Mol. Mass.:
51935.10
Organism:
Rattus norvegicus (Rat)
Description:
P08909
Residue:
460
  
Component 3
Name:
5-hydroxytryptamine receptor 2A
Synonyms:
5-HT-2A 5-HT2A 5-hydroxytryptamine receptor 2A (5HT2A) Htr2 Serotonin Receptor 2A
Type:
G Protein-Coupled Receptor (GPCR)
Mol. Mass.:
52852.05
Organism:
Rattus norvegicus (rat)
Description:
Rat cortex membranes 5-HT2A receptors.
Residue:
471
  
Inhibitor
Name:
BDBM50019966
Synonyms:
2-{4-[(1R,3S)-3-(4-Fluoro-phenyl)-6-trifluoromethyl-indan-1-yl]-piperazin-1-yl}-ethanol CHEMBL95636 | Tefludazine
Type:
Small organic molecule
Emp. Form.:
C22H24F4N2O
Mol. Mass.:
408.4324
SMILES:
OCCN1CCN(CC1)[C@@H]1C[C@H](c2ccc(cc12)C(F)(F)F)c1ccc(F)cc1
: