Target
D(2) dopamine receptor
Ligand
BDBM50020224
Substrate
Meas. Tech.
ChEBML_61596
IC50
31±n/a nM
Citation
 Bøgesø, KPArnt, JBoeck, VChristensen, AVHyttel, JJensen, KG Antihypertensive activity in a series of 1-piperazino-3-phenylindans with potent 5-HT2-antagonistic activity. J Med Chem 31:2247-56 (1989)  
Target
Name:
D(2) dopamine receptor
Synonyms:
DOPAMINE D2 DOPAMINE D2 Short Dopamine D2 receptor Drd2
Type:
G Protein-Coupled Receptor (GPCR)
Mol. Mass.:
50931.60
Organism:
Rattus norvegicus (rat)
Description:
P61169
Residue:
444
  
Inhibitor
Name:
BDBM50020224
Synonyms:
1-[6-Fluoro-3-(4-fluoro-phenyl)-indan-1-yl]-4-methyl-piperazine | CHEMBL70887
Type:
Small organic molecule
Emp. Form.:
C20H22F2N2
Mol. Mass.:
328.3989
SMILES:
CN1CCN(CC1)[C@@H]1C[C@H](c2ccc(F)cc12)c1ccc(F)cc1
: