Target
Phenylethanolamine N-methyltransferase
Ligand
BDBM13016
Substrate
Meas. Tech.
ChEBML_152426
Ki
10300±n/a nM
Citation
 Grunewald, GLSall, DJMonn, JA Conformational and steric aspects of the inhibition of phenylethanolamine N-methyltransferase by benzylamines. J Med Chem 31:433-44 (1988)  
Target
Name:
Phenylethanolamine N-methyltransferase
Synonyms:
Noradrenaline N-methyltransferase PNMT_BOVIN | PNMTase
Type:
Enzyme
Mol. Mass.:
30916.97
Organism:
Bos taurus (bovine)
Description:
Residue:
283
  
Inhibitor
Name:
BDBM13016
Synonyms:
1,2,3,4-tetrahydroisoquinoline THIQ 6 | tetrahydroisoquinoline
Type:
Small organic molecule
Emp. Form.:
C9H11N
Mol. Mass.:
133.1903
SMILES:
C1Cc2ccccc2CN1
: