Target
Mu-type opioid receptor
Ligand
BDBM50018730
Substrate
Meas. Tech.
ChEBML_148991
Ki
0.230000±n/a nM
Citation
 Zimmerman, DMCantrell, BESwartzendruber, JKJones, NDMendelsohn, LGLeander, JDNickander, RC Synthesis and analgesic properties of N-substituted trans-4a-aryldecahydroisoquinolines. J Med Chem 31:555-60 (1988)  
Target
Name:
Mu-type opioid receptor
Synonyms:
MOR-1 Mu-type opioid receptor (MOR) OPRM_RAT Opioid receptor B Ror-b
Type:
G Protein-Coupled Receptor (GPCR)
Mol. Mass.:
44503.11
Organism:
Rattus norvegicus (rat)
Description:
Competition binding assays were carried out using membrane preparations from transfected HN9.10 cells that constitutively expressed the mu opioid receptor.
Residue:
398
  
Inhibitor
Name:
BDBM50018730
Synonyms:
3-(2-Phenethyl-octahydro-isoquinolin-4a-yl)-phenol | CHEMBL359363
Type:
Small organic molecule
Emp. Form.:
C23H29NO
Mol. Mass.:
335.4825
SMILES:
Oc1cccc(c1)C12CCCC[C@H]1CN(CCc1ccccc1)CC2
: