Target
Thymidylate kinase
Ligand
BDBM50367703
Substrate
Meas. Tech.
ChEBML_208561
IC50
290000±n/a nM
Citation
 Davies, LCStock, JABarrie, SEOrr, RMHarrap, KR Dinucleotide analogues as inhibitors of thymidine kinase, thymidylate kinase, and ribonucleotide reductase. J Med Chem 31:1305-8 (1988)  
Target
Name:
Thymidylate kinase
Synonyms:
CDC8 KTHY_HUMAN TYMK
Type:
PROTEIN
Mol. Mass.:
23824.09
Organism:
Homo sapiens (Human)
Description:
ChEMBL_946051
Residue:
212
  
Inhibitor
Name:
BDBM50367703
Synonyms:
CHEMBL1794614 | CHEMBL603793
Type:
Small organic molecule
Emp. Form.:
C20H29N7O20P4
Mol. Mass.:
811.3742
SMILES:
Cc1cn([C@H]2C[C@H](O)[C@@H](COP(O)(=O)OP(O)(=O)OP(O)(=O)OP(O)(=O)OC[C@H]3O[C@H]([C@H](O)[C@@H]3O)n3cnc4c(N)ncnc34)O2)c(=O)[nH]c1=O
: