Target
Thymidylate kinase
Ligand
BDBM50367701
Substrate
Meas. Tech.
ChEBML_208561
IC50
1230000±n/a nM
Citation
 Davies, LCStock, JABarrie, SEOrr, RMHarrap, KR Dinucleotide analogues as inhibitors of thymidine kinase, thymidylate kinase, and ribonucleotide reductase. J Med Chem 31:1305-8 (1988)  
Target
Name:
Thymidylate kinase
Synonyms:
CDC8 KTHY_HUMAN TYMK
Type:
PROTEIN
Mol. Mass.:
23824.09
Organism:
Homo sapiens (Human)
Description:
ChEMBL_946051
Residue:
212
  
Inhibitor
Name:
BDBM50367701
Synonyms:
CHEMBL605228
Type:
Small organic molecule
Emp. Form.:
C20H28N7O17P3
Mol. Mass.:
731.3943
SMILES:
Cc1cn(C2C[C@H](O)[C@@H](COP(O)(=O)OP(O)(=O)OP(O)(=O)OC[C@H]3OC([C@H](O)[C@@H]3O)n3cnc4c(N)ncnc34)O2)c(=O)[nH]c1=O
: