Target
Dihydrofolate reductase
Ligand
BDBM50023718
Substrate
Meas. Tech.
ChEBML_54443
IC50
28±n/a nM
Citation
 Rosowsky, ABader, HCucchi, CAMoran, RGKohler, WFreisheim, JH Methotrexate analogues. 33. N delta-acyl-N alpha-(4-amino-4-deoxypteroyl)-L-ornithine derivatives: synthesis and in vitro antitumor activity. J Med Chem 31:1332-7 (1988)  
Target
Name:
Dihydrofolate reductase
Synonyms:
DYR_MOUSE | Dhfr
Type:
Enzyme
Mol. Mass.:
21608.82
Organism:
Mus musculus (Mouse)
Description:
Residue:
187
  
Inhibitor
Name:
BDBM50023718
Synonyms:
5-Acetylamino-2-{4-[(2,4-diamino-pteridin-6-ylmethyl)-amino]-benzoylamino}-pentanoic acid | CHEMBL423297
Type:
Small organic molecule
Emp. Form.:
C21H25N9O4
Mol. Mass.:
467.4811
SMILES:
CC(=O)NCCCC(NC(=O)c1ccc(NCc2cnc3nc(N)nc(N)c3n2)cc1)C(O)=O
: