Target
5-hydroxytryptamine receptor 1A
Ligand
BDBM50367735
Substrate
Meas. Tech.
ChEBML_1423
Ki
1.3±n/a nM
Citation
 Abou-Gharbia, MPatel, URWebb, MBMoyer, JAAndree, THMuth, EA Polycyclic aryl- and heteroarylpiperazinyl imides as 5-HT1A receptor ligands and potential anxiolytic agents: synthesis and structure-activity relationship studies. J Med Chem 31:1382-92 (1988)  
Target
Name:
5-hydroxytryptamine receptor 1A
Synonyms:
5-HT-1A 5-HT1A 5-hydroxytryptamine receptor 1A (5HT1A) 5ht1a Htr1a Serotonin 1a (5-HT1a) receptor/Adrenergic receptor alpha-1 | Serotonin receptor 1A
Type:
G Protein-Coupled Receptor (GPCR)
Mol. Mass.:
46445.29
Organism:
Rattus norvegicus (rat)
Description:
Binding assays were performed using rat hippocampal membranes.
Residue:
422
  
Inhibitor
Name:
BDBM50367735
Synonyms:
CHEMBL1204093
Type:
Small organic molecule
Emp. Form.:
C27H33N3O3
Mol. Mass.:
447.5692
SMILES:
COc1ccccc1N1CCN(CCCCN2C(=O)C3C(C4C=CC3C3C=CC43)C2=O)CC1
: