Target
Polyunsaturated fatty acid 5-lipoxygenase
Ligand
BDBM50022556
Substrate
Meas. Tech.
ChEBML_3966
IC50
2000±n/a nM
Citation
 Clemence, FLe Martret, ODelevallee, FBenzoni, JJouanen, AJouquey, SMouren, MDeraedt, R 4-Hydroxy-3-quinolinecarboxamides with antiarthritic and analgesic activities. J Med Chem 31:1453-62 (1988)  
Target
Name:
Polyunsaturated fatty acid 5-lipoxygenase
Synonyms:
Alox5 LOX5_RAT
Type:
PROTEIN
Mol. Mass.:
78082.31
Organism:
Rattus norvegicus
Description:
ChEMBL_1432947
Residue:
673
  
Inhibitor
Name:
BDBM50022556
Synonyms:
2-Dichloromethyl-4-hydroxy-8-trifluoromethyl-quinoline-3-carboxylic acid thiazol-2-ylamide | CHEMBL285278
Type:
Small organic molecule
Emp. Form.:
C15H8Cl2F3N3O2S
Mol. Mass.:
422.209
SMILES:
Oc1c(C(=O)Nc2nccs2)c(nc2c(cccc12)C(F)(F)F)C(Cl)Cl
: