Target
Thymidine kinase
Ligand
BDBM50013093
Substrate
Meas. Tech.
ChEBML_207840
EC50
7000±n/a nM
Citation
 Focher, FHildebrand, CFreese, SCiarrocchi, GNoonan, TSangalli, SBrown, NSpadari, SWright, G N2-phenyldeoxyguanosine: a novel selective inhibitor of herpes simplex thymidine kinase. J Med Chem 31:1496-500 (1988)  
Target
Name:
Thymidine kinase
Synonyms:
KITH_HHV1S Thymidine kinase | UL23
Type:
PROTEIN
Mol. Mass.:
40883.42
Organism:
Human herpesvirus 1 (strain SC16) (HHV-1) (Human herpes simplex virus1)
Description:
ChEMBL_213
Residue:
376
  
Inhibitor
Name:
BDBM50013093
Synonyms:
2-(3-Ethyl-4-methyl-phenylamino)-1,9-dihydro-purin-6-one | CHEMBL16026
Type:
Small organic molecule
Emp. Form.:
C14H15N5O
Mol. Mass.:
269.3018
SMILES:
CCc1cc(Nc2nc3nc[nH]c3c(=O)[nH]2)ccc1C
: