Target
D(2) dopamine receptor
Ligand
BDBM50023801
Substrate
Meas. Tech.
ChEBML_61437
IC50
7.7±n/a nM
Citation
 Monkovic, IWillner, DAdam, MABrown, MCrenshaw, RRFuller, CEJuby, PFLuke, GMMatiskella, JAMontzka, TA Substituted benzamides. 1. Potential nondopaminergic antagonists of chemotherapy-induced nausea and emesis. J Med Chem 31:1548-58 (1988)  
Target
Name:
D(2) dopamine receptor
Synonyms:
DOPAMINE D2 DOPAMINE D2 Short Dopamine D2 receptor Drd2
Type:
G Protein-Coupled Receptor (GPCR)
Mol. Mass.:
50931.60
Organism:
Rattus norvegicus (rat)
Description:
P61169
Residue:
444
  
Inhibitor
Name:
BDBM50023801
Synonyms:
3-Amino-2-chloro-11-ethyl-6,7,8,9,10,11,12,13,14,15-decahydro-5-oxa-11,15-diaza-benzocyclotetradecen-16-one | CHEMBL432681
Type:
Small organic molecule
Emp. Form.:
C17H26ClN3O2
Mol. Mass.:
339.86
SMILES:
CCN1CCCCCOc2cc(N)c(Cl)cc2C(=O)NCCC1
: