Target
Adenosylhomocysteinase
Ligand
BDBM50405727
Substrate
Meas. Tech.
ChEBML_197369
IC50
180±n/a nM
Citation
 Madhavan, GVMcGee, DPRydzewski, RMBoehme, RMartin, JCPrisbe, EJ Synthesis and antiviral evaluation of 6'-substituted aristeromycins: potential mechanism-based inhibitors of S-adenosylhomocysteine hydrolase. J Med Chem 31:1798-804 (1988)  
Target
Name:
Adenosylhomocysteinase
Synonyms:
AHCY SAHH | SAHH_HUMAN
Type:
PROTEIN
Mol. Mass.:
47714.06
Organism:
Homo sapiens (Human)
Description:
ChEMBL_1507791
Residue:
432
  
Inhibitor
Name:
BDBM50405727
Synonyms:
CHEMBL2115031
Type:
Small organic molecule
Emp. Form.:
C11H14FN5O3
Mol. Mass.:
283.259
SMILES:
Nc1ncnc2n(cnc12)[C@H]1[C@H](O)[C@H](O)[C@@H](CO)[C@@H]1F
: