Target
Carbonic anhydrase 2
Ligand
BDBM50041029
Substrate
Meas. Tech.
ChEMBL_45240 (CHEMBL658943)
Ki
0.700000±n/a nM
Citation
 Baldwin, JJPonticello, GSAnderson, PSChristy, MEMurcko, MARandall, WCSchwam, HSugrue, MFSpringer, JPGautheron, P Thienothiopyran-2-sulfonamides: novel topically active carbonic anhydrase inhibitors for the treatment of glaucoma. J Med Chem 32:2510-3 (1989)  
Target
Name:
Carbonic anhydrase 2
Synonyms:
CA-II CAC Carbonate dehydratase II Carbonic anhydrase 2 (CA-II) Carbonic anhydrase C Carbonic anhydrase II (CA-II) Carbonic anhydrase II (hCA II) | Carbonic anhydrase isoenzyme II (hCA II)
Type:
Enzyme
Mol. Mass.:
29250.71
Organism:
Homo sapiens (Human)
Description:
P00918
Residue:
260
  
Inhibitor
Name:
BDBM50041029
Synonyms:
(S)-4-Isobutylamino-7,7-dioxo-4,5,6,7-tetrahydro-7lambda*6*-thieno[2,3-b]thiopyran-2-sulfonic acid amide 4-Isopropylamino-7,7-dioxo-4,5,6,7-tetrahydro-7lambda*6*-thieno[2,3-b]thiopyran-2-sulfonic acid amide CHEMBL417975 MK-927
Type:
Small organic molecule
Emp. Form.:
C11H18N2O4S3
Mol. Mass.:
338.467
SMILES:
CC(C)CN[C@H]1CCS(=O)(=O)c2sc(cc12)S(N)(=O)=O
: