Target
5-hydroxytryptamine receptor 1A
Ligand
BDBM50017434
Substrate
Meas. Tech.
ChEMBL_1185 (CHEMBL615951)
Ki
4±n/a nM
Citation
 Abou-Gharbia, MMoyer, JAPatel, UWebb, MSchiehser, GAndree, THaskins, JT Synthesis and structure-activity relationship of substituted tetrahydro- and hexahydro-1,2-benzisothiazol-3-one 1,1-dioxides and thiadiazinones: potential anxiolytic agents. J Med Chem 32:1024-33 (1989)  
Target
Name:
5-hydroxytryptamine receptor 1A
Synonyms:
5-HT-1A 5-HT1A 5-hydroxytryptamine receptor 1A (5HT1A) 5ht1a Htr1a Serotonin 1a (5-HT1a) receptor/Adrenergic receptor alpha-1 | Serotonin receptor 1A
Type:
G Protein-Coupled Receptor (GPCR)
Mol. Mass.:
46445.29
Organism:
Rattus norvegicus (rat)
Description:
Binding assays were performed using rat hippocampal membranes.
Residue:
422
  
Inhibitor
Name:
BDBM50017434
Synonyms:
4-{4-[4-(3-trifluoromethylphenyl)hexahydro-1-pyrazinyl]butyl}-5-sulfo-4-azatetracyclo[5.3.2.02,6.08,10]dodec-11-en-3-one | CHEMBL542293
Type:
Small organic molecule
Emp. Form.:
C25H30F3N3O3S
Mol. Mass.:
509.584
SMILES:
FC(F)(F)c1cccc(c1)N1CCN(CCCCN2C(=O)C3C(C4C=CC3C3CC43)S2(=O)=O)CC1
: