Target
5-hydroxytryptamine receptor 1A
Ligand
BDBM50017444
Substrate
Meas. Tech.
ChEMBL_1183 (CHEMBL615949)
Ki
45±n/a nM
Citation
 Abou-Gharbia, MMoyer, JAPatel, UWebb, MSchiehser, GAndree, THaskins, JT Synthesis and structure-activity relationship of substituted tetrahydro- and hexahydro-1,2-benzisothiazol-3-one 1,1-dioxides and thiadiazinones: potential anxiolytic agents. J Med Chem 32:1024-33 (1989)  
Target
Name:
5-hydroxytryptamine receptor 1A
Synonyms:
5-HT-1A 5-HT1A 5-hydroxytryptamine receptor 1A (5HT1A) 5ht1a Htr1a Serotonin 1a (5-HT1a) receptor/Adrenergic receptor alpha-1 | Serotonin receptor 1A
Type:
G Protein-Coupled Receptor (GPCR)
Mol. Mass.:
46445.29
Organism:
Rattus norvegicus (rat)
Description:
Binding assays were performed using rat hippocampal membranes.
Residue:
422
  
Inhibitor
Name:
BDBM50017444
Synonyms:
4-{4-[4-(3-Chloro-phenyl)-piperazin-1-yl]-butyl}-3,3-dioxo-3lambda*6*-thia-4-aza-tricyclo[5.2.1.0*2,6*]decan-5-one; dihydrochloride | CHEMBL3216410
Type:
Small organic molecule
Emp. Form.:
C22H33Cl4N3O3S
Mol. Mass.:
561.393
SMILES:
Cl.Cl.Cl.Clc1cccc(c1)N1CCN(CCCCN2C(=O)C3C4CCC(C4)C3S2(=O)=O)CC1
: