Target
Adenosine receptor A1
Ligand
BDBM50018003
Substrate
Meas. Tech.
ChEBML_28977
Ki
16±n/a nM
Citation
 Jacobson, KABarone, SKammula, UStiles, GL Electrophilic derivatives of purines as irreversible inhibitors of A1 adenosine receptors. J Med Chem 32:1043-51 (1989)  
Target
Name:
Adenosine receptor A1
Synonyms:
AA1R_RAT ADENOSINE A1 high Adenosine A1 receptor (A1) Adenosine receptors A1 | Adora1
Type:
Protein
Mol. Mass.:
36704.13
Organism:
Rattus norvegicus (rat)
Description:
Residue:
326
  
Inhibitor
Name:
BDBM50018003
Synonyms:
2-[4-(2,6-Dioxo-1,3-dipropyl-2,3,6,7-tetrahydro-1H-purin-8-yl)-phenoxy]-N-{2-[3-(4-fluoro-phenyl)-thioureido]-ethyl}-acetamide | CHEMBL9289
Type:
Small organic molecule
Emp. Form.:
C28H32FN7O4S
Mol. Mass.:
581.662
SMILES:
CCCn1c2nc([nH]c2c(=O)n(CCC)c1=O)-c1ccc(OCC(=O)NCCNC(=S)Nc2ccc(F)cc2)cc1
: