Target
Adenosine receptor A1
Ligand
BDBM50367866
Substrate
Meas. Tech.
ChEBML_28977
Ki
8.4±n/a nM
Citation
 Jacobson, KABarone, SKammula, UStiles, GL Electrophilic derivatives of purines as irreversible inhibitors of A1 adenosine receptors. J Med Chem 32:1043-51 (1989)  
Target
Name:
Adenosine receptor A1
Synonyms:
AA1R_RAT ADENOSINE A1 high Adenosine A1 receptor (A1) Adenosine receptors A1 | Adora1
Type:
Protein
Mol. Mass.:
36704.13
Organism:
Rattus norvegicus (rat)
Description:
Residue:
326
  
Inhibitor
Name:
BDBM50367866
Synonyms:
CHEMBL603923
Type:
Small organic molecule
Emp. Form.:
C22H22N6O8
Mol. Mass.:
498.4455
SMILES:
OC[C@H]1OC([C@H](O)[C@@H]1O)n1cnc2c(Nc3ccc(CC(=O)ON4C(=O)CCC4=O)cc3)ncnc12
: