Target
S-methyl-5'-thioadenosine phosphorylase
Ligand
BDBM50367876
Substrate
Meas. Tech.
ChEMBL_103129 (CHEMBL712300)
Ki
141000±n/a nM
Citation
 Sufrin, JRSpiess, AJKramer, DLLibby, PRPorter, CW Synthesis and antiproliferative effects of novel 5'-fluorinated analogues of 5'-deoxy-5'-(methylthio)adenosine. J Med Chem 32:997-1001 (1989)  
Target
Name:
S-methyl-5'-thioadenosine phosphorylase
Synonyms:
MTAP_MOUSE S-methyl-5-thioadenosine phosphorylase
Type:
PROTEIN
Mol. Mass.:
31064.59
Organism:
Mus musculus
Description:
ChEMBL_12784
Residue:
283
  
Inhibitor
Name:
BDBM50367876
Synonyms:
CHEMBL606328
Type:
Small organic molecule
Emp. Form.:
C12H16FN5O3S
Mol. Mass.:
329.351
SMILES:
CSC(F)C[C@H]1OC([C@H](O)[C@@H]1O)n1cnc2c(N)ncnc12
: