Target
Leucyl-cystinyl aminopeptidase
Ligand
BDBM50017478
Substrate
Meas. Tech.
ChEMBL_98526 (CHEMBL706546)
Ki
220±n/a nM
Citation
 Harbeson, SLRich, DH Inhibition of aminopeptidases by peptides containing ketomethylene and hydroxyethylene amide bond replacements. J Med Chem 32:1378-92 (1989)  
Target
Name:
Leucyl-cystinyl aminopeptidase
Synonyms:
Cystinyl aminopeptidase Insulin-regulated membrane aminopeptidase Irap Leucyl-cystinyl aminopeptidase Otase P-LAP Vesicle protein of 165 kDa | Vp165
Type:
PROTEIN
Mol. Mass.:
117179.39
Organism:
Rattus norvegicus
Description:
ChEMBL_98523
Residue:
1025
  
Inhibitor
Name:
BDBM50017478
Synonyms:
Amastatin Leu[1psi,CHOHCONH]ValValAsp | N-[(2S,3R)-3-amino-2-hydroxy-5-methylhexanoyl]-L-valyl-L-valyl-L-aspartic acid
Type:
Small organic molecule
Emp. Form.:
C21H38N4O8
Mol. Mass.:
474.5484
SMILES:
CC(C)C[C@@H](N)[C@H](O)C(=O)N[C@@H](C(C)C)C(=O)N[C@@H](C(C)C)C(=O)N[C@@H](CC(O)=O)C(O)=O
: