Target
Adenosine receptor A1
Ligand
BDBM50018433
Substrate
Meas. Tech.
ChEBML_29628
Ki
0.930000±n/a nM
Citation
 Jacobson, KAKiriasis, LBarone, SBradbury, BJKammula, UCampagne, JMSecunda, SDaly, JWNeumeyer, JLPfleiderer, W Sulfur-containing 1,3-dialkylxanthine derivatives as selective antagonists at A1-adenosine receptors. J Med Chem 32:1873-9 (1989)  
Target
Name:
Adenosine receptor A1
Synonyms:
AA1R_RAT ADENOSINE A1 high Adenosine A1 receptor (A1) Adenosine receptors A1 | Adora1
Type:
Protein
Mol. Mass.:
36704.13
Organism:
Rattus norvegicus (rat)
Description:
Residue:
326
  
Inhibitor
Name:
BDBM50018433
Synonyms:
CHEMBL52993 | N-(2-Dimethylamino-ethyl)-2-[4-(2,6-dioxo-1,3-dipropyl-2,3,6,7-tetrahydro-1H-purin-8-yl)-phenoxy]-N-methyl-acetamide
Type:
Small organic molecule
Emp. Form.:
C24H34N6O4
Mol. Mass.:
470.5646
SMILES:
CCCn1c2nc([nH]c2c(=O)n(CCC)c1=O)-c1ccc(OCC(=O)N(C)CCN(C)C)cc1
: