Target
5-hydroxytryptamine receptor 3A/3B
Ligand
BDBM50014601
Substrate
Meas. Tech.
ChEMBL_3142 (CHEMBL617984)
Ki
226±n/a nM
Citation
 Nagel, AARosen, TRizzi, JDaffeh, JGuarino, KNowakowski, JVincent, LAHeym, JMcLean, SSeeger, T Aromatic thiazole derivatives: structurally novel and selective serotonin-3 receptor antagonists. J Med Chem 33:13-6 (1990)  
Target
Name:
5-hydroxytryptamine receptor 3A/3B
Synonyms:
Serotonin 3 (5-HT3) receptor | Serotonin 3a (5-HT3a)/3b (5-HT3b) receptor
Type:
Mol. Mass.:
Description:
ASSAY_ID of EBI is 2974
Components:
This complex has 2 components.
Component 1
Name:
5-hydroxytryptamine receptor 3B
Synonyms:
5HT3B_RAT Serotonin (5-HT) receptor
Type:
PROTEIN
Mol. Mass.:
50328.78
Organism:
Rattus norvegicus
Description:
EBI_11885
Residue:
437
  
Component 2
Name:
5-hydroxytryptamine receptor 3A
Synonyms:
5-HT3 5HT3A_RAT Htr3 Serotonin (5-HT) receptor | Zacopride site-R
Type:
Enzyme Catalytic Domain
Mol. Mass.:
55428.70
Organism:
RAT
Description:
5-HT3 HTR3A RAT::P35563
Residue:
483
  
Inhibitor
Name:
BDBM50014601
Synonyms:
2-(2-Methyl-1H-imidazol-4-ylmethyl)-4-phenyl-thiazole | CHEMBL288435
Type:
Small organic molecule
Emp. Form.:
C14H13N3S
Mol. Mass.:
255.338
SMILES:
Cc1ncc(Cc2nc(cs2)-c2ccccc2)[nH]1
: