Target
Amine oxidase [flavin-containing] B
Ligand
BDBM50367917
Substrate
Meas. Tech.
ChEMBL_123767 (CHEMBL732530)
Ki
1600000±n/a nM
Citation
 Bembenek, MEAbell, CWChrisey, LARozwadowska, MDGessner, WBrossi, A Inhibition of monoamine oxidases A and B by simple isoquinoline alkaloids: racemic and optically active 1,2,3,4-tetrahydro-, 3,4-dihydro-, and fully aromatic isoquinolines. J Med Chem 33:147-52 (1990)  
Target
Name:
Amine oxidase [flavin-containing] B
Synonyms:
AOFB_HUMAN MAOB Monoamine oxidase type B (MAO B) Monoamine oxidase type B (MAOB)
Type:
Protein
Mol. Mass.:
58768.76
Organism:
Homo sapiens (Human)
Description:
P27338
Residue:
520
  
Inhibitor
Name:
BDBM50367917
Synonyms:
CHEMBL454315
Type:
Small organic molecule
Emp. Form.:
C13H19NO2
Mol. Mass.:
221.2955
SMILES:
COc1cc2CCN(C)[C@@H](C)c2cc1OC
: