Target
Polyunsaturated fatty acid 5-lipoxygenase
Ligand
BDBM50012689
Substrate
Meas. Tech.
ChEBML_3891
IC50
62±n/a nM
Citation
 Batt, DGMaynard, GDPetraitis, JJShaw, JEGalbraith, WHarris, RR 2-substituted-1-naphthols as potent 5-lipoxygenase inhibitors with topical antiinflammatory activity. J Med Chem 33:360-70 (1990)  
Target
Name:
Polyunsaturated fatty acid 5-lipoxygenase
Synonyms:
Alox5 LOX5_RAT
Type:
PROTEIN
Mol. Mass.:
78082.31
Organism:
Rattus norvegicus
Description:
ChEMBL_1432947
Residue:
673
  
Inhibitor
Name:
BDBM50012689
Synonyms:
2-Benzyl-5,7-dimethyl-naphthalen-1-ol | CHEMBL123283
Type:
Small organic molecule
Emp. Form.:
C19H18O
Mol. Mass.:
262.3456
SMILES:
Cc1cc(C)c2ccc(Cc3ccccc3)c(O)c2c1
: