Target
Polyunsaturated fatty acid 5-lipoxygenase
Ligand
BDBM50012708
Substrate
Meas. Tech.
ChEBML_3891
IC50
56±n/a nM
Citation
 Batt, DGMaynard, GDPetraitis, JJShaw, JEGalbraith, WHarris, RR 2-substituted-1-naphthols as potent 5-lipoxygenase inhibitors with topical antiinflammatory activity. J Med Chem 33:360-70 (1990)  
Target
Name:
Polyunsaturated fatty acid 5-lipoxygenase
Synonyms:
Alox5 LOX5_RAT
Type:
PROTEIN
Mol. Mass.:
78082.31
Organism:
Rattus norvegicus
Description:
ChEMBL_1432947
Residue:
673
  
Inhibitor
Name:
BDBM50012708
Synonyms:
2-Benzyl-4-phenyl-naphthalen-1-ol | CHEMBL332437
Type:
Small organic molecule
Emp. Form.:
C23H18O
Mol. Mass.:
310.3884
SMILES:
Oc1c(Cc2ccccc2)cc(-c2ccccc2)c2ccccc12
: