Target
Polyunsaturated fatty acid 5-lipoxygenase
Ligand
BDBM50012719
Substrate
Meas. Tech.
ChEBML_3891
IC50
70±n/a nM
Citation
 Batt, DGMaynard, GDPetraitis, JJShaw, JEGalbraith, WHarris, RR 2-substituted-1-naphthols as potent 5-lipoxygenase inhibitors with topical antiinflammatory activity. J Med Chem 33:360-70 (1990)  
Target
Name:
Polyunsaturated fatty acid 5-lipoxygenase
Synonyms:
Alox5 LOX5_RAT
Type:
PROTEIN
Mol. Mass.:
78082.31
Organism:
Rattus norvegicus
Description:
ChEMBL_1432947
Residue:
673
  
Inhibitor
Name:
BDBM50012719
Synonyms:
2-(1-Phenyl-ethyl)-naphthalen-1-ol | CHEMBL122986
Type:
Small organic molecule
Emp. Form.:
C18H16O
Mol. Mass.:
248.319
SMILES:
CC(c1ccccc1)c1ccc2ccccc2c1O
: