Target
Polyunsaturated fatty acid 5-lipoxygenase
Ligand
BDBM50012740
Substrate
Meas. Tech.
ChEBML_3891
IC50
140±n/a nM
Citation
 Batt, DGMaynard, GDPetraitis, JJShaw, JEGalbraith, WHarris, RR 2-substituted-1-naphthols as potent 5-lipoxygenase inhibitors with topical antiinflammatory activity. J Med Chem 33:360-70 (1990)  
Target
Name:
Polyunsaturated fatty acid 5-lipoxygenase
Synonyms:
Alox5 LOX5_RAT
Type:
PROTEIN
Mol. Mass.:
78082.31
Organism:
Rattus norvegicus
Description:
ChEMBL_1432947
Residue:
673
  
Inhibitor
Name:
BDBM50012740
Synonyms:
2-(4-Dimethylamino-benzyl)-naphthalen-1-ol | CHEMBL124599
Type:
Small organic molecule
Emp. Form.:
C19H19NO
Mol. Mass.:
277.3603
SMILES:
CN(C)c1ccc(Cc2ccc3ccccc3c2O)cc1
: