Target
5-hydroxytryptamine receptor 2C
Ligand
BDBM50014154
Substrate
Meas. Tech.
ChEBML_1878
Ki
>1000±n/a nM
Citation
 Rosen, TNagel, AARizzi, JPIves, JLDaffeh, JBGanong, AHGuarino, KHeym, JMcLean, SNowakowski, JT Thiazole as a carbonyl bioisostere. A novel class of highly potent and selective 5-HT3 receptor antagonists. J Med Chem 33:2715-20 (1990)  
Target
Name:
5-hydroxytryptamine receptor 2C
Synonyms:
5-HT2C 5-hydroxytryptamine receptor 2C (5HT2c) 5ht1c Htr2c Serotonin receptor 2a and 2c (5HT2A and 5HT2C)
Type:
Enzyme
Mol. Mass.:
51935.10
Organism:
Rattus norvegicus (Rat)
Description:
P08909
Residue:
460
  
Inhibitor
Name:
BDBM50014154
Synonyms:
2-(5-Methyl-1H-imidazol-4-ylmethyl)-4-phenyl-thiazole | CHEMBL38465
Type:
Small organic molecule
Emp. Form.:
C14H13N3S
Mol. Mass.:
255.338
SMILES:
Cc1nc[nH]c1Cc1nc(cs1)-c1ccccc1
: