Target
5-hydroxytryptamine receptor 3A
Ligand
BDBM50013039
Substrate
Meas. Tech.
ChEBML_3470
Ki
3.3±n/a nM
Citation
 Rizzi, JPNagel, AARosen, TMcLean, SSeeger, T An initial three-component pharmacophore for specific serotonin-3 receptor ligands. J Med Chem 33:2721-5 (1990)  
Target
Name:
5-hydroxytryptamine receptor 3A
Synonyms:
5-HT-3 5-HT3A 5-hydroxytryptamine receptor 3 (5-HT3) 5-hydroxytryptamine receptor 3A (5HT3A) 5HT3R HTR3A Serotonin 3 receptor (5HT3) Serotonin-gated ion channel receptor | Serotonin-gated ion channel receptor 3
Type:
Protein
Mol. Mass.:
55283.27
Organism:
Homo sapiens (Human)
Description:
P46098
Residue:
478
  
Inhibitor
Name:
BDBM50013039
Synonyms:
CHEMBL40260 | N-[4-(1H-Indol-3-yl)-thiazol-2-ylmethyl]-guanidine
Type:
Small organic molecule
Emp. Form.:
C13H13N5S
Mol. Mass.:
271.341
SMILES:
NC(=N)NCc1nc(cs1)-c1c[nH]c2ccccc12
: