Target
Sodium-dependent noradrenaline transporter
Ligand
BDBM50014243
Substrate
Meas. Tech.
ChEBML_131452
Ki
59±n/a nM
Citation
 Maryanoff, BEVaught, JLShank, RPMcComsey, DFCostanzo, MJNortey, SO Pyrroloisoquinoline antidepressants. 3. A focus on serotonin. J Med Chem 33:2793-7 (1990)  
Target
Name:
Sodium-dependent noradrenaline transporter
Synonyms:
Norepinephrine transporter Slc6a2 | Sodium-dependent noradrenaline transporter
Type:
Enzyme Catalytic Domain
Mol. Mass.:
69260.85
Organism:
MOUSE
Description:
Norepinephrine transporter 0 MOUSE::O55192
Residue:
617
  
Inhibitor
Name:
BDBM50014243
Synonyms:
CHEMBL95153 | N-[4-(1,2,3,5,6,10b-Hexahydro-pyrrolo[2,1-a]isoquinolin-6-yl)-phenyl]-acetamide
Type:
Small organic molecule
Emp. Form.:
C20H22N2O
Mol. Mass.:
306.4015
SMILES:
CC(=O)Nc1ccc(cc1)C1CN2CCCC2c2ccccc12
: