Target
Sodium-dependent noradrenaline transporter
Ligand
BDBM50014232
Substrate
Meas. Tech.
ChEBML_131452
Ki
0.940000±n/a nM
Citation
 Maryanoff, BEVaught, JLShank, RPMcComsey, DFCostanzo, MJNortey, SO Pyrroloisoquinoline antidepressants. 3. A focus on serotonin. J Med Chem 33:2793-7 (1990)  
Target
Name:
Sodium-dependent noradrenaline transporter
Synonyms:
Norepinephrine transporter Slc6a2 | Sodium-dependent noradrenaline transporter
Type:
Enzyme Catalytic Domain
Mol. Mass.:
69260.85
Organism:
MOUSE
Description:
Norepinephrine transporter 0 MOUSE::O55192
Residue:
617
  
Inhibitor
Name:
BDBM50014232
Synonyms:
6-(4-Ethynyl-phenyl)-1,2,3,5,6,10b-hexahydro-pyrrolo[2,1-a]isoquinoline | CHEMBL330666
Type:
Small organic molecule
Emp. Form.:
C20H19N
Mol. Mass.:
273.3716
SMILES:
C#Cc1ccc(cc1)C1CN2CCCC2c2ccccc12
: