Target
Alpha-1A adrenergic receptor
Ligand
BDBM50010864
Substrate
Meas. Tech.
ChEBML_88911
IC50
300±n/a nM
Citation
 Yardley, JPHusbands, GEStack, GButch, JBicksler, JMoyer, JAMuth, EAAndree, TFletcher, HJames, MN 2-Phenyl-2-(1-hydroxycycloalkyl)ethylamine derivatives: synthesis and antidepressant activity. J Med Chem 33:2899-905 (1990)  
Target
Name:
Alpha-1A adrenergic receptor
Synonyms:
ADA1A_RAT Adra1c Alpha-1A adrenoceptor Alpha-1C adrenergic receptor | adrenergic Alpha1A
Type:
Protein
Mol. Mass.:
51620.15
Organism:
Rattus norvegicus (Rat)
Description:
P43140
Residue:
466
  
Inhibitor
Name:
BDBM50010864
Synonyms:
1-[2-Dimethylamino-1-(4-methoxy-phenyl)-ethyl]-cycloheptanol (HCl.0.5H2O) | CHEMBL101056
Type:
Small organic molecule
Emp. Form.:
C18H29NO2
Mol. Mass.:
291.4284
SMILES:
COc1ccc(cc1)C(CN(C)C)C1(O)CCCCCC1
: