Target
Alpha-1A adrenergic receptor
Ligand
BDBM50010884
Substrate
Meas. Tech.
ChEBML_88911
IC50
360±n/a nM
Citation
 Yardley, JPHusbands, GEStack, GButch, JBicksler, JMoyer, JAMuth, EAAndree, TFletcher, HJames, MN 2-Phenyl-2-(1-hydroxycycloalkyl)ethylamine derivatives: synthesis and antidepressant activity. J Med Chem 33:2899-905 (1990)  
Target
Name:
Alpha-1A adrenergic receptor
Synonyms:
ADA1A_RAT Adra1c Alpha-1A adrenoceptor Alpha-1C adrenergic receptor | adrenergic Alpha1A
Type:
Protein
Mol. Mass.:
51620.15
Organism:
Rattus norvegicus (Rat)
Description:
P43140
Residue:
466
  
Inhibitor
Name:
BDBM50010884
Synonyms:
1-(2-(dimethylamino)-1-(3-(trifluoromethyl)phenyl)ethyl)cyclohexanol CHEMBL99653
Type:
Small organic molecule
Emp. Form.:
C17H24F3NO
Mol. Mass.:
315.3738
SMILES:
CN(C)CC(c1cccc(c1)C(F)(F)F)C1(O)CCCCC1
: