Target
Aromatase
Ligand
BDBM50014319
Substrate
Meas. Tech.
ChEBML_50885
Ki
5±n/a nM
Citation
 Cole, PARobinson, CH Mechanism and inhibition of cytochrome P-450 aromatase. J Med Chem 33:2933-42 (1990)  
Target
Name:
Aromatase
Synonyms:
ARO1 CP19A_HUMAN CYP19 CYPXIX Cytochrome P450 19A1 Cytochrome P450-C19 (CYP19) FL cytokine receptor precursor | P-450AROM
Type:
Enzyme
Mol. Mass.:
57888.92
Organism:
Homo sapiens (Human)
Description:
P11511
Residue:
503
  
Inhibitor
Name:
BDBM50014319
Synonyms:
9-Hydroxy-2-phenyl-benzo[h]chromen-4-one | CHEMBL329500
Type:
Small organic molecule
Emp. Form.:
C19H12O3
Mol. Mass.:
288.2968
SMILES:
Oc1ccc2ccc3c(oc(cc3=O)-c3ccccc3)c2c1
: