Target
D(2) dopamine receptor
Ligand
BDBM50007136
Substrate
Meas. Tech.
ChEMBL_58367 (CHEMBL672804)
EC50
>10000±n/a nM
Citation
 DeNinno, MPSchoenleber, RAsin, KEMacKenzie, RKebabian, JW (1R,3S)-1-(aminomethyl)-3,4-dihydro-5,6-dihydroxy-3-phenyl-1H-2-benzopyran: a potent and selective D1 agonist. J Med Chem 33:2948-50 (1990)  
Target
Name:
D(2) dopamine receptor
Synonyms:
DOPAMINE D2 DOPAMINE D2 Short Dopamine D2 receptor Drd2
Type:
G Protein-Coupled Receptor (GPCR)
Mol. Mass.:
50931.60
Organism:
Rattus norvegicus (rat)
Description:
P61169
Residue:
444
  
Inhibitor
Name:
BDBM50007136
Synonyms:
1-Aminomethyl-3-phenyl-isochroman-5,6-diol | CHEMBL83080
Type:
Small organic molecule
Emp. Form.:
C16H17NO3
Mol. Mass.:
271.3111
SMILES:
NC[C@H]1O[C@H](Cc2c(O)c(O)ccc12)c1ccccc1
: