Target
Ribonucleoside-diphosphate reductase large subunit
Ligand
BDBM50013371
Substrate
Meas. Tech.
ChEMBL_195110 (CHEMBL795005)
IC50
20000±n/a nM
Citation
 Gaudreau, PParadis, HLangelier, YBrazeau, P Synthesis and inhibitory potency of peptides corresponding to the subunit 2 C-terminal region of herpes virus ribonucleotide reductases. J Med Chem 33:723-30 (1990)  
Target
Name:
Ribonucleoside-diphosphate reductase large subunit
Synonyms:
ICP6 RIR1 Ribonucleoside-diphosphate reductase large chain Ribonucleotide reductase 136 kDa subunit | Ribonucleotide reductase large subunit
Type:
PROTEIN
Mol. Mass.:
124049.68
Organism:
Human herpesvirus 1 (strain 17) (HHV-1) (Human herpes simplex virus1)
Description:
ChEMBL_195109
Residue:
1137
  
Inhibitor
Name:
BDBM50013371
Synonyms:
Ac-Tyr-Ala-Gly-Ala-Val-Val-Asn-Asp-Leu | CHEMBL434474
Type:
Small organic molecule
Emp. Form.:
C43H66N10O15
Mol. Mass.:
963.0421
SMILES:
CC(C)C[C@H](NC(=O)[C@H](CC(O)=O)NC(=O)[C@H](CC(N)=O)NC(=O)[C@@H](NC(=O)[C@@H](NC(=O)[C@H](C)NC(=O)CNC(=O)[C@H](C)NC(=O)[C@H](Cc1ccc(O)cc1)NC(C)=O)C(C)C)C(C)C)C(O)=O
: