Target
Glutamate receptor ionotropic, NMDA 1
Ligand
BDBM50007778
Substrate
Meas. Tech.
ChEBML_154061
Ki
12±n/a nM
Citation
 Monn, JAThurkauf, AMattson, MVJacobson, AERice, KC Synthesis and structure-activity relationship of C5-substituted analogues of (+-)-10,11-dihydro-5H-dibenzo[a,d]cyclohepten-5,10-imine [(+-)-desmethyl-MK801]: ligands for the NMDA receptor-coupled phencyclidine binding site. J Med Chem 33:1069-76 (1990)  
Target
Name:
Glutamate receptor ionotropic, NMDA 1
Synonyms:
Glutamate (NMDA) receptor subunit zeta 1 Glutamate-NMDA-Channel Glutamate-NMDA-Polyamine NMDA Nmdar1 | phencyclidine
Type:
Enzyme Catalytic Domain
Mol. Mass.:
105533.40
Organism:
RAT
Description:
P35439
Residue:
938
  
Inhibitor
Name:
BDBM50007778
Synonyms:
1-ethyl-16-azatetracyclo[7.6.1.02,7.010,15]hexadeca-2(7),3,5,10(15),11,13-hexaene CHEMBL269213
Type:
Small organic molecule
Emp. Form.:
C17H17N
Mol. Mass.:
235.3236
SMILES:
CCC12NC(Cc3ccccc13)c1ccccc21
: