Target
Voltage-dependent L-type calcium channel subunit alpha-1C
Ligand
BDBM50226978
Substrate
Meas. Tech.
ChEMBL_42758 (CHEMBL653728)
Kd
120±n/a nM
Citation
 Atwal, KSRovnyak, GCSchwartz, JMoreland, SHedberg, AGougoutas, JZMalley, MFFloyd, DM Dihydropyrimidine calcium channel blockers: 2-heterosubstituted 4-aryl-1,4-dihydro-6-methyl-5-pyrimidinecarboxylic acid esters as potent mimics of dihydropyridines. J Med Chem 33:1510-5 (1990)  
Target
Name:
Voltage-dependent L-type calcium channel subunit alpha-1C
Synonyms:
CAC1C_HUMAN CACN2 CACNL1A1 Calcium channel (Type L) L-type calcium channel alpha-1c/beta-2/alpha2delta-1 Voltage-gated L-type calcium channel Voltage-gated calcium channel | Voltage-gated calcium channel subunit alpha Cav1.2
Type:
Enzyme Catalytic Domain
Mol. Mass.:
248979.79
Organism:
Homo sapiens (Human)
Description:
Calcium channel (Type L) 0 HUMAN::Q13936
Residue:
2221
  
Inhibitor
Name:
BDBM50226978
Synonyms:
CHEMBL282279
Type:
Small organic molecule
Emp. Form.:
C14H15N3O4S
Mol. Mass.:
321.352
SMILES:
COC(=O)C1=C(C)N=C(NC1c1cccc(c1)[N+]([O-])=O)SC
: