Target
Delta-type opioid receptor
Ligand
BDBM50013623
Substrate
Meas. Tech.
ChEMBL_146439 (CHEMBL757336)
Ki
0.140000±n/a nM
Citation
 Portoghese, PSSultana, MTakemori, AE Design of peptidomimetic delta opioid receptor antagonists using the message-address concept. J Med Chem 33:1714-20 (1990)  
Target
Name:
Delta-type opioid receptor
Synonyms:
D-OR-1 Delta opioid receptor OPIATE Delta OPRD1 OPRK1 | opioid receptor, delta 1
Type:
G Protein-Coupled Receptor (GPCR)
Mol. Mass.:
40382.98
Organism:
Homo sapiens (Human)
Description:
Competition binding assays were carried out using membrane preparations from transfected HN9.10 cells that constitutively expressed the delta opioid receptor.
Residue:
372
  
Inhibitor
Name:
BDBM50013623
Synonyms:
9-bromo-22-cyclopropylmethyl-(2S,13R)-14-oxa-11,22-diazaheptacyclo[13.9.1.01,13.02,21.04,12.05,10.019,25]pentacosa-4(12),5(10),6,8,15(25),16,18-heptaene-2,16-diol
Type:
Small organic molecule
Emp. Form.:
C26H25BrN2O3
Mol. Mass.:
493.392
SMILES:
Oc1ccc2CC3N(CC4CC4)CC[C@@]45[C@@H](Oc1c24)c1[nH]c2c(Br)cccc2c1C[C@@]35O
: