Target
Muscarinic acetylcholine receptor M2
Ligand
BDBM50015728
Substrate
Meas. Tech.
ChEBML_140172
Kd
2.7±n/a nM
Citation
 Cereda, EEzhaya, AGil Quintero, MBellora, EDubini, EMicheletti, RSchiavone, ABrambilla, ASchiavi, GBDonetti, A Synthesis and biological evaluation of new antimuscarinic compounds with amidine basic centers. A useful bioisosteric replacement of classical cationic heads. J Med Chem 33:2108-13 (1990)  
Target
Name:
Muscarinic acetylcholine receptor M2
Synonyms:
ACM2_RAT Chrm-2 | Chrm2
Type:
Enzyme Catalytic Domain
Mol. Mass.:
51555.53
Organism:
RAT
Description:
P10980
Residue:
466
  
Inhibitor
Name:
BDBM50015728
Synonyms:
3-(3-Hydroxy-2-phenyl-propionyloxy)-8,8-dimethyl-8-azonia-bicyclo[3.2.1]octane; bromide(atropine methyl bromide) | CHEMBL63452
Type:
Small organic molecule
Emp. Form.:
C18H26NO3
Mol. Mass.:
304.4034
SMILES:
C[N+]1(C)C2CCC1CC(C2)OC(=O)C(CO)c1ccccc1
: