Target
D(1A) dopamine receptor
Ligand
BDBM50010729
Substrate
Meas. Tech.
ChEBML_58183
IC50
38000±n/a nM
Citation
 Claudi, FCardellini, MCingolani, GMPiergentili, APeruzzi, GBalduini, W Synthesis and dopamine receptor affinities of 2-(4-fluoro-3- hydroxyphenyl)ethylamine and N-substituted derivatives. J Med Chem 33:2408-12 (1990)  
Target
Name:
D(1A) dopamine receptor
Synonyms:
DOPAMINE D1 Dopamine D1 high Dopamine receptor Dopamine1-like Drd1a
Type:
Enzyme Catalytic Domain
Mol. Mass.:
49429.75
Organism:
RAT
Description:
P18901
Residue:
446
  
Inhibitor
Name:
BDBM50010729
Synonyms:
2-Fluoro-4-[2-(phenethyl-propyl-amino)-ethyl]-phenol; hydrobromide | CHEMBL538012
Type:
Small organic molecule
Emp. Form.:
C19H24FNO
Mol. Mass.:
301.3984
SMILES:
CCCN(CCc1ccccc1)CCc1ccc(O)c(F)c1
: