Target
Renin
Ligand
BDBM50014124
Substrate
Meas. Tech.
ChEBML_195950
IC50
870±n/a nM
Citation
 Dutta, ASGormley, JJMcLachlan, PFMajor, JS Novel inhibitors of human renin. Cyclic peptides based on the tetrapeptide sequence Glu-D-Phe-Lys-D-Trp. J Med Chem 33:2552-60 (1990)  
Target
Name:
Renin
Synonyms:
Angiotensinogenase RENI_HUMAN
Type:
Enzyme
Mol. Mass.:
45058.99
Organism:
Homo sapiens (Human)
Description:
Residue:
406
  
Inhibitor
Name:
BDBM50014124
Synonyms:
(1-{5-Amino-1-[2-(1H-indol-3-yl)-1-(3-methyl-butylcarbamoyl)-ethylcarbamoyl]-pentyl}-3-benzyl-2,5,9-trioxo-[1,4]diazonan-6-yl)-carbamic acid benzyl ester | CHEMBL313326
Type:
Small organic molecule
Emp. Form.:
C44H55N7O7
Mol. Mass.:
793.9502
SMILES:
CC(C)CCNC(=O)[C@H](Cc1c[nH]c2ccccc12)NC(=O)[C@H](CCCCN)n1c(O)ccc(NC(O)OCc2ccccc2)c(=O)[nH]c(Cc2ccccc2)c1O
: