Target
Renin
Ligand
BDBM50014130
Substrate
Meas. Tech.
ChEBML_195950
IC50
290±n/a nM
Citation
 Dutta, ASGormley, JJMcLachlan, PFMajor, JS Novel inhibitors of human renin. Cyclic peptides based on the tetrapeptide sequence Glu-D-Phe-Lys-D-Trp. J Med Chem 33:2552-60 (1990)  
Target
Name:
Renin
Synonyms:
Angiotensinogenase RENI_HUMAN
Type:
Enzyme
Mol. Mass.:
45058.99
Organism:
Homo sapiens (Human)
Description:
Residue:
406
  
Inhibitor
Name:
BDBM50014130
Synonyms:
2-{2-[2-[6-Amino-2-(3-benzyl-6-benzyloxycarbonylamino-2,5,9-trioxo-[1,4]diazonan-1-yl)-hexanoylamino]-3-(1H-indol-3-yl)-propionylamino]-4-methyl-pentanoylamino}-4-methylsulfanyl-butyric acid methyl ester | CHEMBL269722
Type:
Small organic molecule
Emp. Form.:
C51H66N8O10S
Mol. Mass.:
983.182
SMILES:
COC(=O)[C@@H](CCSC)NC(=O)[C@H](CC(C)C)NC(=O)[C@H](Cc1c[nH]c2ccccc12)NC(=O)[C@H](CCCCN)n1c(O)ccc(NC(O)OCc2ccccc2)c(=O)[nH]c(Cc2ccccc2)c1O
: