Target
Mu-type opioid receptor
Ligand
BDBM50008851
Substrate
Meas. Tech.
ChEBML_146264
Ki
>1000±n/a nM
Citation
 Halfpenny, PRHorwell, DCHughes, JHumblet, CHunter, JCNeuhaus, DRees, DC Highly selective kappa opioid analgesics. 4. Synthesis of some conformationally restricted naphthalene derivatives with high receptor affinity and selectivity. J Med Chem 34:190-4 (1991)  
Target
Name:
Mu-type opioid receptor
Synonyms:
M-OR-1 Mu opioid receptor OPIATE Mu OPRM_CAVPO
Type:
Enzyme Catalytic Domain
Mol. Mass.:
11165.58
Organism:
GUINEA PIG
Description:
P97266
Residue:
98
  
Inhibitor
Name:
BDBM50008851
Synonyms:
2-Benzo[b]thiophen-4-yl-N-methyl-N-(2-pyrrolidin-1-yl-cyclohexyl)-propionamide; hydrochloride | CHEMBL553114
Type:
Small organic molecule
Emp. Form.:
C22H30N2OS
Mol. Mass.:
370.551
SMILES:
CC(C(=O)N(C)[C@H]1CCCC[C@@H]1N1CCCC1)c1cccc2sccc12
: