Target
Kappa-type opioid receptor
Ligand
BDBM50008856
Substrate
Meas. Tech.
ChEBML_145227
Ki
0.370000±n/a nM
Citation
 Halfpenny, PRHorwell, DCHughes, JHumblet, CHunter, JCNeuhaus, DRees, DC Highly selective kappa opioid analgesics. 4. Synthesis of some conformationally restricted naphthalene derivatives with high receptor affinity and selectivity. J Med Chem 34:190-4 (1991)  
Target
Name:
Kappa-type opioid receptor
Synonyms:
Kappa Opioid Receptor OPRK1 Opiate Kappa 1 | mu/kappa opioid receptor
Type:
G Protein-Coupled Receptor (GPCR)
Mol. Mass.:
42744.99
Organism:
Cavia porcellus (domestic guinea pig)
Description:
P41144
Residue:
380
  
Inhibitor
Name:
BDBM50008856
Synonyms:
2-Methyl-acenaphthene-1-carboxylic acid methyl-(7-pyrrolidin-1-yl-1-oxa-spiro[4.5]dec-8-yl)-amide; hydrochloride | CHEMBL544276
Type:
Small organic molecule
Emp. Form.:
C28H36N2O2
Mol. Mass.:
432.5976
SMILES:
CC1C(C(=O)N(C)[C@H]2CCC3(CCCO3)C[C@@H]2N2CCCC2)c2cccc3cccc1c23
: