Target
Kappa-type opioid receptor
Ligand
BDBM50008851
Substrate
Meas. Tech.
ChEMBL_145227 (CHEMBL755678)
Ki
176±n/a nM
Citation
 Halfpenny, PRHorwell, DCHughes, JHumblet, CHunter, JCNeuhaus, DRees, DC Highly selective kappa opioid analgesics. 4. Synthesis of some conformationally restricted naphthalene derivatives with high receptor affinity and selectivity. J Med Chem 34:190-4 (1991)  
Target
Name:
Kappa-type opioid receptor
Synonyms:
Kappa Opioid Receptor OPRK1 Opiate Kappa 1 | mu/kappa opioid receptor
Type:
G Protein-Coupled Receptor (GPCR)
Mol. Mass.:
42744.99
Organism:
Cavia porcellus (domestic guinea pig)
Description:
P41144
Residue:
380
  
Inhibitor
Name:
BDBM50008851
Synonyms:
2-Benzo[b]thiophen-4-yl-N-methyl-N-(2-pyrrolidin-1-yl-cyclohexyl)-propionamide; hydrochloride | CHEMBL553114
Type:
Small organic molecule
Emp. Form.:
C22H30N2OS
Mol. Mass.:
370.551
SMILES:
CC(C(=O)N(C)[C@H]1CCCC[C@@H]1N1CCCC1)c1cccc2sccc12
: