Target
Dihydrofolate reductase
Ligand
BDBM50010935
Substrate
Meas. Tech.
ChEBML_54214
IC50
19000±n/a nM
Citation
 Rosowsky, AForsch, RAMoran, RGFreisheim, JH Synthesis and biological activity of the 2-desamino and 2-desamino-2-methyl analogues of aminopterin and methotrexate. J Med Chem 34:227-34 (1991)  
Target
Name:
Dihydrofolate reductase
Synonyms:
DHFR Dihydrofolate reductase (DHFR) | Tetrahydrofolate dehydrogenase
Type:
Enzyme
Mol. Mass.:
21453.99
Organism:
Homo sapiens (Human)
Description:
Recombinant human DHFR.
Residue:
187
  
Inhibitor
Name:
BDBM50010935
Synonyms:
2-{4-[(4-Amino-pteridin-6-ylmethyl)-amino]-benzoylamino}-pentanedioic acid | CHEMBL430797
Type:
Small organic molecule
Emp. Form.:
C19H19N7O5
Mol. Mass.:
425.3981
SMILES:
Nc1ncnc2ncc(CNc3ccc(cc3)C(=O)NC(CCC(O)=O)C(O)=O)nc12
: