Target
Muscarinic acetylcholine receptor M1
Ligand
BDBM50368148
Substrate
Meas. Tech.
ChEBML_139202
Ki
7110±n/a nM
Citation
 Triggle, DJKwon, YWAbraham, PPitner, JBMascarella, SWCarroll, FI Synthesis, molecular modeling studies, and muscarinic receptor activity of azaprophen analogues. J Med Chem 34:3164-71 (1991)  
Target
Name:
Muscarinic acetylcholine receptor M1
Synonyms:
ACM1_RAT Chrm-1 cholinergic receptor, muscarinic 1
Type:
Enzyme Catalytic Domain
Mol. Mass.:
51390.46
Organism:
RAT
Description:
P08482
Residue:
460
  
Inhibitor
Name:
BDBM50368148
Synonyms:
CHEMBL325322
Type:
Small organic molecule
Emp. Form.:
C10H17NO2
Mol. Mass.:
183.2475
SMILES:
CN1CC2CC1CC(C2)OC(C)=O
: