Target
Muscarinic acetylcholine receptor M1
Ligand
BDBM50453023
Substrate
Meas. Tech.
ChEMBL_138934 (CHEMBL746583)
Ki
23100±n/a nM
Citation
 Triggle, DJKwon, YWAbraham, PPitner, JBMascarella, SWCarroll, FI Synthesis, molecular modeling studies, and muscarinic receptor activity of azaprophen analogues. J Med Chem 34:3164-71 (1991)  
Target
Name:
Muscarinic acetylcholine receptor M1
Synonyms:
ACM1_RAT Chrm-1 cholinergic receptor, muscarinic 1
Type:
Enzyme Catalytic Domain
Mol. Mass.:
51390.46
Organism:
RAT
Description:
P08482
Residue:
460
  
Inhibitor
Name:
BDBM50453023
Synonyms:
CHEMBL2113669
Type:
Small organic molecule
Emp. Form.:
C17H23NO2
Mol. Mass.:
273.37
SMILES:
[H][C@]12CN([C@H](C)c3ccccc3)[C@]([H])(C1)C[C@@H](C2)OC(C)=O
: