Target
D(2) dopamine receptor
Ligand
BDBM50010294
Substrate
Meas. Tech.
ChEBML_59152
Ki
3.2±n/a nM
Citation
 Bakthavachalam, VBaindur, NMadras, BKNeumeyer, JL Fluorescent probes for dopamine receptors: synthesis and characterization of fluorescein and 7-nitrobenz-2-oxa-1,3-diazol-4-yl conjugates of D-1 and D-2 receptor ligands. J Med Chem 34:3235-41 (1991)  
Target
Name:
D(2) dopamine receptor
Synonyms:
D(2) dopamine receptor DOPAMINE D2 Long DRD2 Dopamine D2 receptor Dopamine D2 receptor (D2R) Dopamine2-like | d2
Type:
Cell-surface receptors
Mol. Mass.:
50647.10
Organism:
Homo sapiens (Human)
Description:
P14416
Residue:
443
  
Inhibitor
Name:
BDBM50010294
Synonyms:
(R)6-({2-[4-(7-Nitro-benzo[1,2,5]oxadiazol-4-ylamino)-phenyl]-ethyl}-propyl-amino)-5,6,7,8-tetrahydro-naphthalen-1-ol (S)6-({2-[4-(7-Nitro-benzo[1,2,5]oxadiazol-4-ylamino)-phenyl]-ethyl}-propyl-amino)-5,6,7,8-tetrahydro-naphthalen-1-ol CHEMBL113196
Type:
Small organic molecule
Emp. Form.:
C27H29N5O4
Mol. Mass.:
487.5503
SMILES:
CCCN(CCc1ccc(Nc2ccc([N+]([O-])=O)c3n[o+][n-]c23)cc1)C1CCc2c(O)cccc2C1
: