Target
D(2) dopamine receptor
Ligand
BDBM50010290
Substrate
Meas. Tech.
ChEBML_59152
Ki
1600±n/a nM
Citation
 Bakthavachalam, VBaindur, NMadras, BKNeumeyer, JL Fluorescent probes for dopamine receptors: synthesis and characterization of fluorescein and 7-nitrobenz-2-oxa-1,3-diazol-4-yl conjugates of D-1 and D-2 receptor ligands. J Med Chem 34:3235-41 (1991)  
Target
Name:
D(2) dopamine receptor
Synonyms:
D(2) dopamine receptor DOPAMINE D2 Long DRD2 Dopamine D2 receptor Dopamine D2 receptor (D2R) Dopamine2-like | d2
Type:
Cell-surface receptors
Mol. Mass.:
50647.10
Organism:
Homo sapiens (Human)
Description:
P14416
Residue:
443
  
Inhibitor
Name:
BDBM50010290
Synonyms:
5-(4-Amino-phenyl)-8-bromo-3-methyl-2,3,4,5-tetrahydro-1H-benzo[d]azepin-7-ol | CHEMBL321042
Type:
Small organic molecule
Emp. Form.:
C17H19BrN2O
Mol. Mass.:
347.25
SMILES:
CN1CCc2cc(Br)c(O)cc2C(C1)c1ccc(N)cc1
: